Reaction Details
TargetLethal factor
LigandBDBM50340786
Substrate/Competitorn/a
Meas. Tech.ChEMBL_740261 (CHEMBL1764161)
Ki 3.8±n/a nM
Citation Kim, SJiao, GSMoayeri, MCrown, DCregar-Hernandez, LMcKasson, LMargosiak, SALeppla, SHJohnson, AT Antidotes to anthrax lethal factor intoxication. Part 2: structural modifications leading to improved in vivo efficacy. Bioorg Med Chem Lett21:2030-3 (2011) 
 
Lethal factor
Name:Lethal factor
Type:PROTEIN
Mol. Mass.:93758.56
Organism:Bacillus anthracis
Description:ChEMBL_1460338
Residue:809
BDBM50340786
NameBDBM50340786
Synonyms:(R)-2-(3-chloro-4-fluorophenylamino)-6-(4-fluorobenzylamino)-N-hydroxyhexanamide | CHEMBL1760456
TypeSmall organic molecule
Emp. Form.C19H22ClF2N3O2
Mol. Mass.397.847
SMILESONC(=O)[C@@H](CCCCNCc1ccc(F)cc1)Nc1ccc(F)c(Cl)c1