Reaction Details
TargetAmine oxidase [flavin-containing] A
LigandBDBM50341156
Substrate/Competitorn/a
Meas. Tech.ChEMBL_740451 (CHEMBL1764565)
Ki 396.57±n/a nM
Citation Mishra, NSasmal, D Development of selective and reversible pyrazoline based MAO-B inhibitors: virtual screening, synthesis and biological evaluation. Bioorg Med Chem Lett21:1969-73 (2011) 
 
Amine oxidase [flavin-containing] A
Name:Amine oxidase [flavin-containing] A
Type:Enzyme
Mol. Mass.:59515.21
Organism:Rattus norvegicus (rat)
Description:n/a
Residue:526
BDBM50341156
NameBDBM50341156
Synonyms:3-(anthracen-9-yl)-5-phenyl-4,5-dihydro-1H-pyrazole | CHEMBL1760717
TypeSmall organic molecule
Emp. Form.C23H18N2
Mol. Mass.322.4024
SMILESC1C(N=NC1c1c2ccccc2cc2ccccc12)c1ccccc1