Reaction Details
TargetAmine oxidase [flavin-containing] B
LigandBDBM50341155
Substrate/Competitorn/a
Meas. Tech.ChEMBL_740467 (CHEMBL1764622)
Ki 3.8±n/a nM
Citation Mishra, NSasmal, D Development of selective and reversible pyrazoline based MAO-B inhibitors: virtual screening, synthesis and biological evaluation. Bioorg Med Chem Lett21:1969-73 (2011) 
 
Amine oxidase [flavin-containing] B
Name:Amine oxidase [flavin-containing] B
Type:Enzyme
Mol. Mass.:58469.65
Organism:Rattus norvegicus (rat)
Description:P19643
Residue:520
BDBM50341155
NameBDBM50341155
Synonyms:3-(anthracen-9-yl)-5-p-tolyl-4,5-dihydro-1H-pyrazole | CHEMBL1760716
TypeSmall organic molecule
Emp. Form.C24H20N2
Mol. Mass.336.429
SMILESCc1ccc(cc1)C1CC(N=N1)c1c2ccccc2cc2ccccc12