Reaction Details
TargetAmine oxidase [flavin-containing] B
LigandBDBM50341156
Substrate/Competitorn/a
Meas. Tech.ChEMBL_740467 (CHEMBL1764622)
Ki 3.43±n/a nM
Citation Mishra, NSasmal, D Development of selective and reversible pyrazoline based MAO-B inhibitors: virtual screening, synthesis and biological evaluation. Bioorg Med Chem Lett21:1969-73 (2011) 
 
Amine oxidase [flavin-containing] B
Name:Amine oxidase [flavin-containing] B
Type:Enzyme
Mol. Mass.:58469.65
Organism:Rattus norvegicus (rat)
Description:P19643
Residue:520
BDBM50341156
NameBDBM50341156
Synonyms:3-(anthracen-9-yl)-5-phenyl-4,5-dihydro-1H-pyrazole | CHEMBL1760717
TypeSmall organic molecule
Emp. Form.C23H18N2
Mol. Mass.322.4024
SMILESC1C(N=NC1c1c2ccccc2cc2ccccc12)c1ccccc1