Reaction Details
TargetHemagglutinin-neuraminidase
LigandBDBM50341451
Substrate/Competitorn/a
Meas. Tech.ChEMBL_741750 (CHEMBL1769849)
IC50 7700000±n/a nM
Citation Nishino, RIkeda, KHayakawa, TTakahashi, TSuzuki, TSato, M Syntheses of 2-deoxy-2,3-didehydro-N-acetylneuraminic acid analogues modified by N-sulfonylamidino groups at the C-4 position and biological evaluation as inhibitors of human parainfluenza virus type 1. Bioorg Med Chem19:2418-27 (2011) 
 
Hemagglutinin-neuraminidase
Name:Hemagglutinin-neuraminidase
Synonyms:n/a
Type:PROTEIN
Mol. Mass.:64031.12
Organism:Human parainfluenza virus 1
Description:ChEMBL_741750
Residue:575
BDBM50341451
NameBDBM50341451
TypeSmall organic molecule
Emp. Form.C24H35N3O10S
Mol. Mass.557.614
SMILESCC(C)N=C(CCO[C@H]1C=C(O[C@@H]([C@H](O)[C@H](O)CO)[C@@H]1NC(C)=O)C(O)=O)NS(=O)(=O)c1ccc(C)cc1