Reaction Details
TargetHemagglutinin-neuraminidase
LigandBDBM50341458
Substrate/Competitorn/a
Meas. Tech.ChEMBL_741750 (CHEMBL1769849)
IC50 1500000±n/a nM
Citation Nishino, RIkeda, KHayakawa, TTakahashi, TSuzuki, TSato, M Syntheses of 2-deoxy-2,3-didehydro-N-acetylneuraminic acid analogues modified by N-sulfonylamidino groups at the C-4 position and biological evaluation as inhibitors of human parainfluenza virus type 1. Bioorg Med Chem19:2418-27 (2011) 
 
Hemagglutinin-neuraminidase
Name:Hemagglutinin-neuraminidase
Synonyms:n/a
Type:PROTEIN
Mol. Mass.:64031.12
Organism:Human parainfluenza virus 1
Description:ChEMBL_741750
Residue:575
BDBM50341458
NameBDBM50341458
TypeSmall organic molecule
Emp. Form.C20H31N3O9S
Mol. Mass.489.54
SMILESCC(=O)N[C@@H]1[C@H](C=C(O[C@H]1[C@H](O)[C@H](O)CO)C(O)=O)N=C(CC1=CCCCC1)NS(C)(=O)=O