Reaction Details
TargetCytochrome P450 11B2, mitochondrial
LigandBDBM50000306
Substrate/Competitorn/a
Meas. Tech.ChEMBL_742192 (CHEMBL1768362)
IC50 28±n/a nM
Citation Lucas, SNegri, MHeim, RZimmer, CHartmann, RW Fine-tuning the selectivity of aldosterone synthase inhibitors: structure-activity and structure-selectivity insights from studies of heteroaryl substituted 1,2,5,6-tetrahydropyrrolo[3,2,1-ij]quinolin-4-one derivatives. J Med Chem54:2307-19 (2011) 
 
Cytochrome P450 11B2, mitochondrial
Name:Cytochrome P450 11B2, mitochondrial
Type:Protein
Mol. Mass.:57582.15
Organism:Homo sapiens (Human)
Description:P19099
Residue:503
BDBM50000306
NameBDBM50000306
Synonyms:6-Pyridin-3-yl-3,4-dihydro-1H-quinolin-2-one 6-Pyridin-3-yl-3,4-dihydroquinolin-2(1H)-on | CHEMBL62811
TypeSmall organic molecule
Emp. Form.C14H12N2O
Mol. Mass.224.2579
SMILESO=C1CCc2cc(ccc2N1)-c1cccnc1