Reaction Details
TargetMast/stem cell growth factor receptor Kit
LigandBDBM50341524
Substrate/Competitorn/a
Meas. Tech.ChEMBL_742136 (CHEMBL1769196)
Ki 148±n/a nM
Citation Charrier, JDMiller, AKay, DPBrenchley, GTwin, HCCollier, PNRamaya, SKeily, SBDurrant, SJKnegtel, RMTanner, AJBrown, KCurnock, APJimenez, JM Discovery and structure-activity relationship of 3-aminopyrid-2-ones as potent and selective interleukin-2 inducible T-cell kinase (Itk) inhibitors. J Med Chem54:2341-50 (2011) 
 
Mast/stem cell growth factor receptor Kit
Name:Mast/stem cell growth factor receptor Kit
Type:Protein
Mol. Mass.:109869.37
Organism:Homo sapiens (Human)
Description:P10721
Residue:976
BDBM50341524
NameBDBM50341524
Synonyms:3-(4-(Piperidin-1-yl)benzoylamino)-5-(6-(methylamino)pyridin-2-yl)-(1H)-pyridin-2-one | CHEMBL1765777
TypeSmall organic molecule
Emp. Form.C23H25N5O2
Mol. Mass.403.4769
SMILESCNc1cccc(n1)-c1c[nH]c(=O)c(NC(=O)c2ccc(cc2)N2CCCCC2)c1