Reaction Details
TargetTyrosine-protein kinase ITK/TSK
LigandBDBM50341544
Substrate/Competitorn/a
Meas. Tech.ChEMBL_741887 (CHEMBL1768448)
Ki 140±n/a nM
Citation Charrier, JDMiller, AKay, DPBrenchley, GTwin, HCCollier, PNRamaya, SKeily, SBDurrant, SJKnegtel, RMTanner, AJBrown, KCurnock, APJimenez, JM Discovery and structure-activity relationship of 3-aminopyrid-2-ones as potent and selective interleukin-2 inducible T-cell kinase (Itk) inhibitors. J Med Chem54:2341-50 (2011) 
 
Tyrosine-protein kinase ITK/TSK
Name:Tyrosine-protein kinase ITK/TSK
Type:Protein
Mol. Mass.:71839.20
Organism:Homo sapiens (Human)
Description:Q08881
Residue:620
BDBM50341544
NameBDBM50341544
Synonyms:3-(4-(Piperidin-1-yl)phenylcarbamoyl)-5-(pyridin-4-yl)-(1H)-pyridin-2-one | CHEMBL1765785
TypeSmall organic molecule
Emp. Form.C22H22N4O2
Mol. Mass.374.4357
SMILESO=C(Nc1ccc(cc1)N1CCCCC1)c1cc(c[nH]c1=O)-c1ccncc1