Reaction Details
TargetMast/stem cell growth factor receptor Kit
LigandBDBM50341540
Substrate/Competitorn/a
Meas. Tech.ChEMBL_742136 (CHEMBL1769196)
Ki 27±n/a nM
Citation Charrier, JDMiller, AKay, DPBrenchley, GTwin, HCCollier, PNRamaya, SKeily, SBDurrant, SJKnegtel, RMTanner, AJBrown, KCurnock, APJimenez, JM Discovery and structure-activity relationship of 3-aminopyrid-2-ones as potent and selective interleukin-2 inducible T-cell kinase (Itk) inhibitors. J Med Chem54:2341-50 (2011) 
 
Mast/stem cell growth factor receptor Kit
Name:Mast/stem cell growth factor receptor Kit
Type:Protein
Mol. Mass.:109869.37
Organism:Homo sapiens (Human)
Description:P10721
Residue:976
BDBM50341540
NameBDBM50341540
Synonyms:3-(4-tert-Butylbenzoylamino)-5-(pyridin-4-yl)-(1H)-pyridin-2-one | CHEMBL1765770
TypeSmall organic molecule
Emp. Form.C21H21N3O2
Mol. Mass.347.4103
SMILESCC(C)(C)c1ccc(cc1)C(=O)Nc1cc(c[nH]c1=O)-c1ccncc1