Reaction Details
TargetReceptor-type tyrosine-protein kinase FLT3
LigandBDBM50341542
Substrate/Competitorn/a
Meas. Tech.ChEMBL_742046 (CHEMBL1768909)
Ki 8±n/a nM
Citation Charrier, JDMiller, AKay, DPBrenchley, GTwin, HCCollier, PNRamaya, SKeily, SBDurrant, SJKnegtel, RMTanner, AJBrown, KCurnock, APJimenez, JM Discovery and structure-activity relationship of 3-aminopyrid-2-ones as potent and selective interleukin-2 inducible T-cell kinase (Itk) inhibitors. J Med Chem54:2341-50 (2011) 
 
Receptor-type tyrosine-protein kinase FLT3
Name:Receptor-type tyrosine-protein kinase FLT3
Type:Enzyme
Mol. Mass.:112888.62
Organism:Homo sapiens (Human)
Description:P36888
Residue:993
BDBM50341542
NameBDBM50341542
Synonyms:3-(4-Dimethylaminobenzoylamino)-5-(pyridin-4-yl)-(1H)-pyridin-2-one | CHEMBL1765772
TypeSmall organic molecule
Emp. Form.C19H18N4O2
Mol. Mass.334.3718
SMILESCN(C)c1ccc(cc1)C(=O)Nc1cc(c[nH]c1=O)-c1ccncc1