Reaction Details
TargetSomatostatin receptor type 2
LigandBDBM50341575
Substrate/Competitorn/a
Meas. Tech.ChEMBL_743882 (CHEMBL1767825)
Ki 0.025±n/a nM
Citation Wolkenberg, SEZhao, ZThut, CMaxwell, JWMcDonald, TPKinose, FReilly, MLindsley, CWHartman, GD Design, synthesis, and evaluation of novel 3,6-diaryl-4-aminoalkoxyquinolines as selective agonists of somatostatin receptor subtype 2. J Med Chem54:2351-8 (2011) 
 
Somatostatin receptor type 2
Name:Somatostatin receptor type 2
Type:Enzyme
Mol. Mass.:41344.94
Organism:Homo sapiens (Human)
Description:P30874
Residue:369
BDBM50341575
NameBDBM50341575
Synonyms:7-Chloro-3-(3,5-dimethylphenyl)-6-(1-methyl-1H-pyrazol-4-yl)-4-{2-[(2R)-piperidin-2-yl]ethoxy}quinoline | CHEMBL1766100
TypeSmall organic molecule
Emp. Form.C28H31ClN4O
Mol. Mass.475.025
SMILESCc1cc(C)cc(c1)-c1cnc2cc(Cl)c(cc2c1OCC[C@H]1CCCCN1)-c1cnn(C)c1