Reaction Details
TargetNitric oxide synthase, brain
LigandBDBM50341681
Substrate/Competitorn/a
Meas. Tech.ChEMBL_743326 (CHEMBL1767573)
Ki 103±n/a nM
Citation Xue, FFang, JDelker, SLLi, HMartásek, PRoman, LJPoulos, TLSilverman, RB Symmetric double-headed aminopyridines, a novel strategy for potent and membrane-permeable inhibitors of neuronal nitric oxide synthase. J Med Chem54:2039-48 (2011) 
 
Nitric oxide synthase, brain
Name:Nitric oxide synthase, brain
Type:Enzyme
Mol. Mass.:160570.98
Organism:Rattus norvegicus (rat)
Description:Recombinant nNOS overexpressed in E. coli was used in enzyme assays.
Residue:1429
BDBM50341681
NameBDBM50341681
Synonyms:4-(2-(5-(2-(6-Amino-4-methylpyridin-2-yl)ethyl)pyridin-3-yl)ethyl)-6-methylpyridin-2-amine CHEMBL1615289 | NOS Inhibitor, 3k
TypeSmall organic molecule
Emp. Form.C21H25N5
Mol. Mass.347.4567
SMILESCc1cc(N)nc(CCc2cncc(CCc3cc(C)nc(N)c3)c2)c1