Reaction Details
TargetNitric oxide synthase, brain
LigandBDBM50341682
Substrate/Competitorn/a
Meas. Tech.ChEMBL_743326 (CHEMBL1767573)
Ki 25±n/a nM
Citation Xue, FFang, JDelker, SLLi, HMartásek, PRoman, LJPoulos, TLSilverman, RB Symmetric double-headed aminopyridines, a novel strategy for potent and membrane-permeable inhibitors of neuronal nitric oxide synthase. J Med Chem54:2039-48 (2011) 
 
Nitric oxide synthase, brain
Name:Nitric oxide synthase, brain
Type:Enzyme
Mol. Mass.:160570.98
Organism:Rattus norvegicus (rat)
Description:Recombinant nNOS overexpressed in E. coli was used in enzyme assays.
Residue:1429
BDBM50341682
NameBDBM50341682
Synonyms:6,6'-(2,2'-(Pyridine-3,5-diyl)bis(ethane-2,1-diyl))bis(4methylpyridin-2-amine) CHEMBL1615288 US10759791, Compound 2a | US9951014, Name 2a
TypeSmall organic molecule
Emp. Form.C21H25N5
Mol. Mass.347.4567
SMILESCc1cc(N)nc(CCc2cncc(CCc3cc(C)cc(N)n3)c2)c1