Reaction Details
TargetPoly [ADP-ribose] polymerase 1
LigandBDBM50341859
Substrate/Competitorn/a
Meas. Tech.ChEMBL_743711 (CHEMBL1767525)
IC50 30±n/a nM
Citation Sunderland, PTWoon, ECDhami, ABergin, ABMahon, MFWood, PJJones, LATully, SRLloyd, MDThompson, ASJavaid, HMartin, NMThreadgill, MD 5-Benzamidoisoquinolin-1-ones and 5-(κ-carboxyalkyl)isoquinolin-1-ones as isoform-selective inhibitors of poly(ADP-ribose) polymerase 2 (PARP-2). J Med Chem54:2049-59 (2011) 
 
Poly [ADP-ribose] polymerase 1
Name:Poly [ADP-ribose] polymerase 1
Type:n/a
Mol. Mass.:113114.22
Organism:Homo sapiens (Human)
Description:P09874
Residue:1014
BDBM50341859
NameBDBM50341859
Synonyms:2-(4-chlorophenyl)quinoxaline-5-carboxamide | CHEMBL1767067
TypeSmall organic molecule
Emp. Form.C15H10ClN3O
Mol. Mass.283.712
SMILESNC(=O)c1cccc2nc(cnc12)-c1ccc(Cl)cc1