Reaction Details
TargetCytochrome P450 26A1
LigandBDBM50176808
Substrate/Competitorn/a
Meas. Tech.ChEMBL_744044 (CHEMBL1768149)
IC50 540±n/a nM
Citation Gomaa, MSBridgens, CEAboraia, ASVeal, GJRedfern, CPBrancale, AArmstrong, JLSimons, C Small molecule inhibitors of retinoic acid 4-hydroxylase (CYP26): synthesis and biological evaluation of imidazole methyl 3-(4-(aryl-2-ylamino)phenyl)propanoates. J Med Chem54:2778-91 (2011) 
 
Cytochrome P450 26A1
Name:Cytochrome P450 26A1
Type:Enzyme
Mol. Mass.:56216.16
Organism:Homo sapiens (Human)
Description:O43174
Residue:497
BDBM50176808
NameBDBM50176808
Synonyms:5-[(3-Chloro-phenyl)-imidazol-1-yl-methyl]-1H-benzoimidazole CHEMBL389433 US9144538, Liarizole hydrochloride | liarozole
TypeSmall organic molecule
Emp. Form.C17H13ClN4
Mol. Mass.308.765
SMILESClc1cccc(c1)C(c1ccc2nc[nH]c2c1)n1ccnc1