Reaction Details
TargetMitogen-activated protein kinase 8
LigandBDBM50342308
Substrate/Competitorn/a
Meas. Tech.ChEMBL_744057 (CHEMBL1768207)
IC50 2300±n/a nM
Citation De, SKBarile, EChen, VStebbins, JLCellitti, JFMachleidt, TCarlson, CBYang, LDahl, RPellecchia, M Design, synthesis, and structure-activity relationship studies of thiophene-3-carboxamide derivatives as dual inhibitors of the c-Jun N-terminal kinase. Bioorg Med Chem19:2582-8 (2011) 
 
Mitogen-activated protein kinase 8
Name:Mitogen-activated protein kinase 8
Type:Enzyme
Mol. Mass.:48297.57
Organism:Homo sapiens (Human)
Description:JNK-1 was purchased from Upstate Cell Signaling Solutions (formerly Upstate Biotechnology).
Residue:427
BDBM50342308
NameBDBM50342308
Synonyms:2-(2-(2-methoxy-5-methylphenyl)acetamido)thiophene-3-carboxamide | CHEMBL1767251
TypeSmall organic molecule
Emp. Form.C15H16N2O3S
Mol. Mass.304.364
SMILESCOc1ccc(C)cc1CC(=O)Nc1sccc1C(N)=O