Reaction Details
TargetMitogen-activated protein kinase 8
LigandBDBM50342314
Substrate/Competitorn/a
Meas. Tech.ChEMBL_744057 (CHEMBL1768207)
IC50 2700±n/a nM
Citation De, SKBarile, EChen, VStebbins, JLCellitti, JFMachleidt, TCarlson, CBYang, LDahl, RPellecchia, M Design, synthesis, and structure-activity relationship studies of thiophene-3-carboxamide derivatives as dual inhibitors of the c-Jun N-terminal kinase. Bioorg Med Chem19:2582-8 (2011) 
 
Mitogen-activated protein kinase 8
Name:Mitogen-activated protein kinase 8
Type:Enzyme
Mol. Mass.:48297.57
Organism:Homo sapiens (Human)
Description:JNK-1 was purchased from Upstate Cell Signaling Solutions (formerly Upstate Biotechnology).
Residue:427
BDBM50342314
NameBDBM50342314
Synonyms:2-(2-(3,5-dimethylphenyl)acetamido)thiophene-3-carboxamide | CHEMBL1767244
TypeSmall organic molecule
Emp. Form.C15H16N2O2S
Mol. Mass.288.365
SMILESCc1cc(C)cc(CC(=O)Nc2sccc2C(N)=O)c1