Reaction Details
TargetMitogen-activated protein kinase 8
LigandBDBM50342316
Substrate/Competitorn/a
Meas. Tech.ChEMBL_744057 (CHEMBL1768207)
IC50 2900±n/a nM
Citation De, SKBarile, EChen, VStebbins, JLCellitti, JFMachleidt, TCarlson, CBYang, LDahl, RPellecchia, M Design, synthesis, and structure-activity relationship studies of thiophene-3-carboxamide derivatives as dual inhibitors of the c-Jun N-terminal kinase. Bioorg Med Chem19:2582-8 (2011) 
 
Mitogen-activated protein kinase 8
Name:Mitogen-activated protein kinase 8
Type:Enzyme
Mol. Mass.:48297.57
Organism:Homo sapiens (Human)
Description:JNK-1 was purchased from Upstate Cell Signaling Solutions (formerly Upstate Biotechnology).
Residue:427
BDBM50342316
NameBDBM50342316
Synonyms:2-(2-(2-bromophenyl)acetamido)thiophene-3-carboxamide | CHEMBL1767260
TypeSmall organic molecule
Emp. Form.C13H11BrN2O2S
Mol. Mass.339.208
SMILESNC(=O)c1ccsc1NC(=O)Cc1ccccc1Br