Reaction Details
TargetMitogen-activated protein kinase 9
LigandBDBM50342301
Substrate/Competitorn/a
Meas. Tech.ChEMBL_742810 (CHEMBL1769813)
Kd 640±n/a nM
Citation De, SKBarile, EChen, VStebbins, JLCellitti, JFMachleidt, TCarlson, CBYang, LDahl, RPellecchia, M Design, synthesis, and structure-activity relationship studies of thiophene-3-carboxamide derivatives as dual inhibitors of the c-Jun N-terminal kinase. Bioorg Med Chem19:2582-8 (2011) 
 
Mitogen-activated protein kinase 9
Name:Mitogen-activated protein kinase 9
Type:Enzyme
Mol. Mass.:48131.49
Organism:Homo sapiens (Human)
Description:JNK-2 was purchased from Upstate Cell Signaling Solutions (formerly Upstate Biotechnology).
Residue:424
BDBM50342301
NameBDBM50342301
Synonyms:2-(2-(benzo[b]thiophen-3-yl)acetamido)thiophene-3-carboxamide | CHEMBL1767254
TypeSmall organic molecule
Emp. Form.C15H12N2O2S2
Mol. Mass.316.398
SMILESNC(=O)c1ccsc1NC(=O)Cc1csc2ccccc12