Reaction Details
TargetHydroxycarboxylic acid receptor 2
LigandBDBM50342526
Substrate/Competitorn/a
Meas. Tech.ChEMBL_744661 (CHEMBL1772682)
IC50 100±n/a nM
Citation Imbriglio, JEDiRocco, DBodner, RRaghavan, SChen, WMarley, DEsser, CHolt, TGWolff, MSTaggart, AKWaters, MGTata, JRColletti, SL The discovery of high affinity agonists of GPR109a with reduced serum shift and improved ADME properties. Bioorg Med Chem Lett21:2721-4 (2011) 
 
Hydroxycarboxylic acid receptor 2
Name:Hydroxycarboxylic acid receptor 2
Type:G Protein-Coupled Receptor (GPCR)
Mol. Mass.:41868.22
Organism:Homo sapiens (Human)
Description:Membranes from CHO cells expressing the recombinant human GPR109A were used in competition binding assay.
Residue:363
BDBM50342526
NameBDBM50342526
Synonyms:2-((2S)-2-amino-3-(3-(5-hydroxypyridin-2-yl)-1,2,4-oxadiazol-5-yl)butanamido)benzoic acid | CHEMBL1770354
TypeSmall organic molecule
Emp. Form.C18H17N5O5
Mol. Mass.383.3581
SMILESCC([C@H](N)C(=O)Nc1ccccc1C(O)=O)c1nc(no1)-c1ccc(O)cn1