Reaction Details
TargetHydroxycarboxylic acid receptor 2
LigandBDBM50313977
Substrate/Competitorn/a
Meas. Tech.ChEMBL_744662 (CHEMBL1772683)
EC50 24±n/a nM
Citation Imbriglio, JEDiRocco, DBodner, RRaghavan, SChen, WMarley, DEsser, CHolt, TGWolff, MSTaggart, AKWaters, MGTata, JRColletti, SL The discovery of high affinity agonists of GPR109a with reduced serum shift and improved ADME properties. Bioorg Med Chem Lett21:2721-4 (2011) 
 
Hydroxycarboxylic acid receptor 2
Name:Hydroxycarboxylic acid receptor 2
Type:G Protein-Coupled Receptor (GPCR)
Mol. Mass.:41868.22
Organism:Homo sapiens (Human)
Description:Membranes from CHO cells expressing the recombinant human GPR109A were used in competition binding assay.
Residue:363
BDBM50313977
NameBDBM50313977
Synonyms:2-(3-(3-(5-hydroxypyridin-2-yl)-1,2,4-oxadiazol-5-yl)propanamido)cyclohex-1-enecarboxylic acid | CHEMBL1087302
TypeSmall organic molecule
Emp. Form.C17H18N4O5
Mol. Mass.358.3486
SMILESOC(=O)C1=C(CCCC1)NC(=O)CCc1nc(no1)-c1ccc(O)cn1