Reaction Details
TargetHydroxycarboxylic acid receptor 2
LigandBDBM50342529
Substrate/Competitorn/a
Meas. Tech.ChEMBL_744661 (CHEMBL1772682)
IC50 20±n/a nM
Citation Imbriglio, JEDiRocco, DBodner, RRaghavan, SChen, WMarley, DEsser, CHolt, TGWolff, MSTaggart, AKWaters, MGTata, JRColletti, SL The discovery of high affinity agonists of GPR109a with reduced serum shift and improved ADME properties. Bioorg Med Chem Lett21:2721-4 (2011) 
 
Hydroxycarboxylic acid receptor 2
Name:Hydroxycarboxylic acid receptor 2
Type:G Protein-Coupled Receptor (GPCR)
Mol. Mass.:41868.22
Organism:Homo sapiens (Human)
Description:Membranes from CHO cells expressing the recombinant human GPR109A were used in competition binding assay.
Residue:363
BDBM50342529
NameBDBM50342529
Synonyms:2-((S)-2-amino-3-(3-(5-hydroxypyridin-2-yl)-1,2,4-oxadiazol-5-yl)propanamido)-5-methylcyclohex-1-enecarboxylic acid | CHEMBL1770357
TypeSmall organic molecule
Emp. Form.C18H21N5O5
Mol. Mass.387.3898
SMILESCC1CCC(NC(=O)[C@@H](N)Cc2nc(no2)-c2ccc(O)cn2)=C(C1)C(O)=O