Reaction Details
TargetHydroxycarboxylic acid receptor 2
LigandBDBM50342530
Substrate/Competitorn/a
Meas. Tech.ChEMBL_744662 (CHEMBL1772683)
EC50 60±n/a nM
Citation Imbriglio, JEDiRocco, DBodner, RRaghavan, SChen, WMarley, DEsser, CHolt, TGWolff, MSTaggart, AKWaters, MGTata, JRColletti, SL The discovery of high affinity agonists of GPR109a with reduced serum shift and improved ADME properties. Bioorg Med Chem Lett21:2721-4 (2011) 
 
Hydroxycarboxylic acid receptor 2
Name:Hydroxycarboxylic acid receptor 2
Type:G Protein-Coupled Receptor (GPCR)
Mol. Mass.:41868.22
Organism:Homo sapiens (Human)
Description:Membranes from CHO cells expressing the recombinant human GPR109A were used in competition binding assay.
Residue:363
BDBM50342530
NameBDBM50342530
Synonyms:2-(3-(4'-hydroxybiphenyl-4-yl)propanamido)benzoic acid | CHEMBL1085711
TypeSmall organic molecule
Emp. Form.C22H19NO4
Mol. Mass.361.3906
SMILESOC(=O)c1ccccc1NC(=O)CCc1ccc(cc1)-c1ccc(O)cc1