Reaction Details
TargetHistone deacetylase 2
LigandBDBM50342752
Substrate/Competitorn/a
Meas. Tech.ChEMBL_744275 (CHEMBL1772082)
IC50 3600±n/a nM
Citation Tang, WLuo, TGreenberg, EFBradner, JESchreiber, SL Discovery of histone deacetylase 8 selective inhibitors. Bioorg Med Chem Lett21:2601-5 (2011) 
 
Histone deacetylase 2
Name:Histone deacetylase 2
Type:Chromatin regulator; hydrolase; repressor
Mol. Mass.:55356.54
Organism:Homo sapiens (Human)
Description:Q92769
Residue:488
BDBM50342752
NameBDBM50342752
Synonyms:3-(2-(3-(((R)-5,12-dioxo-2-phenyl-1-oxa-4-azacyclododec-8-en-4-yl)methyl)benzylidene)hydrazinecarbonyl)-N-hydroxybenzamide | CHEMBL1771486
TypeSmall organic molecule
Emp. Form.C32H32N4O6
Mol. Mass.568.6197
SMILESONC(=O)c1cccc(c1)C(=O)N\N=C\c1cccc(CN2C[C@H](OC(=O)CC\C=C\CCC2=O)c2ccccc2)c1