Reaction Details
TargetHistone deacetylase 2
LigandBDBM19149
Substrate/Competitorn/a
Meas. Tech.ChEMBL_744275 (CHEMBL1772082)
IC50 66±n/a nM
Citation Tang, WLuo, TGreenberg, EFBradner, JESchreiber, SL Discovery of histone deacetylase 8 selective inhibitors. Bioorg Med Chem Lett21:2601-5 (2011) 
 
Histone deacetylase 2
Name:Histone deacetylase 2
Type:Chromatin regulator; hydrolase; repressor
Mol. Mass.:55356.54
Organism:Homo sapiens (Human)
Description:Q92769
Residue:488
BDBM19149
NameBDBM19149
Synonyms:CHEMBL98 SAHA US10188756, Compound SAHA US11505523, Compound SAHA US9353061, SAHA US9695181, Vorinostat Zolinza suberoylanilide hydroxamic acid
TypeSmall organic molecule
Emp. Form.C14H20N2O3
Mol. Mass.264.3202
SMILESONC(=O)CCCCCCC(=O)Nc1ccccc1