Reaction Details
TargetSynaptic vesicular amine transporter
LigandBDBM50342818
Substrate/Competitorn/a
Meas. Tech.ChEMBL_744748 (CHEMBL1772769)
Ki 36400±n/a nM
Citation Yao, ZWei, XWu, XKatz, JLKopajtic, TGreig, NHSun, H Preparation and evaluation of tetrabenazine enantiomers and all eight stereoisomers of dihydrotetrabenazine as VMAT2 inhibitors. Eur J Med Chem46:1841-8 (2011) 
 
Synaptic vesicular amine transporter
Name:Synaptic vesicular amine transporter
Type:Protein
Mol. Mass.:55689.58
Organism:Rattus norvegicus (Rat)
Description:Q01827
Residue:515
BDBM50342818
NameBDBM50342818
Synonyms:(3S,11BS)-TETRABENAZINE | CHEMBL519344
TypeSmall organic molecule
Emp. Form.C19H27NO3
Mol. Mass.317.4226
SMILESCOc1cc2CCN3C[C@H](CC(C)C)C(=O)C[C@H]3c2cc1OC