Reaction Details
TargetSodium/glucose cotransporter 1
LigandBDBM50313368
Substrate/Competitorn/a
Meas. Tech.ChEMBL_745218 (CHEMBL1772494)
IC50 1540±n/a nM
Citation Mascitti, VMaurer, TSRobinson, RPBian, JBoustany-Kari, CMBrandt, TCollman, BMKalgutkar, ASKlenotic, MKLeininger, MTLowe, AMaguire, RJMasterson, VMMiao, ZMukaiyama, EPatel, JDPettersen, JCPréville, CSamas, BShe, LSobol, ZSteppan, CMStevens, BDThuma, BATugnait, MZeng, DZhu, T Discovery of a clinical candidate from the structurally unique dioxa-bicyclo[3.2.1]octane class of sodium-dependent glucose cotransporter 2 inhibitors. J Med Chem54:2952-60 (2011) 
 
Sodium/glucose cotransporter 1
Name:Sodium/glucose cotransporter 1
Type:Protein
Mol. Mass.:73503.78
Organism:Homo sapiens (Human)
Description:P13866
Residue:664
BDBM50313368
NameBDBM50313368
Synonyms:(6S,7R,8R,9S)-6-(3-(4-methoxybenzyl)-4-methylphenyl)-2,5-dioxaspiro[3.5]nonane-7,8,9-triol | CHEMBL1090058
TypeSmall organic molecule
Emp. Form.C22H26O6
Mol. Mass.386.4382
SMILESCOc1ccc(Cc2cc(ccc2C)[C@@H]2OC3(COC3)[C@@H](O)[C@H](O)[C@H]2O)cc1