Reaction Details
TargetDisintegrin and metalloproteinase domain-containing protein 17
LigandBDBM50342943
Substrate/Competitorn/a
Meas. Tech.ChEMBL_744258 (CHEMBL1772065)
IC50 4481±n/a nM
Citation Dai, CLi, DPopovici-Muller, JZhao, LGirijavallabhan, VMRosner, KELavey, BJRizvi, RShankar, BBWong, MKGuo, ZOrth, PStrickland, COSun, JNiu, XChen, SKozlowski, JALundell, DJPiwinski, JJShih, NYSiddiqui, MA 2-(2-Aminothiazol-4-yl)pyrrolidine-based tartrate diamides as potent, selective and orally bioavailable TACE inhibitors. Bioorg Med Chem Lett21:3172-6 (2011) 
 
Disintegrin and metalloproteinase domain-containing protein 17
Name:Disintegrin and metalloproteinase domain-containing protein 17
Type:Enzyme
Mol. Mass.:93007.89
Organism:Homo sapiens (Human)
Description:
Residue:824
BDBM50342943
NameBDBM50342943
Synonyms:(2R,3R)-N-((R)-1-(4-(1H-pyrazol-1-yl)phenyl)ethyl)-2,3-dihydroxy-4-oxo-4-((R)-2-(2-(propylamino)thiazol-4-yl)pyrrolidin-1-yl)butanamide | CHEMBL1770647
TypeSmall organic molecule
Emp. Form.C25H32N6O4S
Mol. Mass.512.624
SMILESCCCNc1nc(cs1)[C@H]1CCCN1C(=O)[C@H](O)[C@@H](O)C(=O)N[C@H](C)c1ccc(cc1)-n1cccn1