Reaction Details
TargetCollagenase 3
LigandBDBM50342945
Substrate/Competitorn/a
Meas. Tech.ChEMBL_744288 (CHEMBL1772145)
Ki>40000±n/a nM
Citation Dai, CLi, DPopovici-Muller, JZhao, LGirijavallabhan, VMRosner, KELavey, BJRizvi, RShankar, BBWong, MKGuo, ZOrth, PStrickland, COSun, JNiu, XChen, SKozlowski, JALundell, DJPiwinski, JJShih, NYSiddiqui, MA 2-(2-Aminothiazol-4-yl)pyrrolidine-based tartrate diamides as potent, selective and orally bioavailable TACE inhibitors. Bioorg Med Chem Lett21:3172-6 (2011) 
 
Collagenase 3
Name:Collagenase 3
Type:Enzyme
Mol. Mass.:53808.06
Organism:Homo sapiens (Human)
Description:P45452
Residue:471
BDBM50342945
NameBDBM50342945
Synonyms:(2R,3R)-N-((R)-1-(4-(1H-pyrazol-1-yl)phenyl)ethyl)-4-((R)-2-(2-(cyclopropylamino)thiazol-4-yl)pyrrolidin-1-yl)-2,3-dihydroxy-4-oxobutanamide | CHEMBL1770649
TypeSmall organic molecule
Emp. Form.C25H30N6O4S
Mol. Mass.510.608
SMILESC[C@@H](NC(=O)[C@H](O)[C@@H](O)C(=O)N1CCC[C@@H]1c1csc(NC2CC2)n1)c1ccc(cc1)-n1cccn1