Reaction Details
TargetDisintegrin and metalloproteinase domain-containing protein 17
LigandBDBM50342968
Substrate/Competitorn/a
Meas. Tech.ChEMBL_744255 (CHEMBL1772062)
Ki 2.6±n/a nM
Citation Dai, CLi, DPopovici-Muller, JZhao, LGirijavallabhan, VMRosner, KELavey, BJRizvi, RShankar, BBWong, MKGuo, ZOrth, PStrickland, COSun, JNiu, XChen, SKozlowski, JALundell, DJPiwinski, JJShih, NYSiddiqui, MA 2-(2-Aminothiazol-4-yl)pyrrolidine-based tartrate diamides as potent, selective and orally bioavailable TACE inhibitors. Bioorg Med Chem Lett21:3172-6 (2011) 
 
Disintegrin and metalloproteinase domain-containing protein 17
Name:Disintegrin and metalloproteinase domain-containing protein 17
Type:Enzyme
Mol. Mass.:93007.89
Organism:Homo sapiens (Human)
Description:
Residue:824
BDBM50342968
NameBDBM50342968
Synonyms:(2R,3R)-N-((R)-1-(4-(1H-pyrazol-1-yl)phenyl)ethyl)-4-((S)-1-(4-chlorophenyl)-6,7-dimethoxy-3,4-dihydroisoquinolin-2(1H)-yl)-2,3-dihydroxy-4-oxobutanamide | CHEMBL1770637
TypeSmall organic molecule
Emp. Form.C32H33ClN4O6
Mol. Mass.605.081
SMILESCOc1cc2CCN([C@@H](c3ccc(Cl)cc3)c2cc1OC)C(=O)[C@H](O)[C@@H](O)C(=O)N[C@H](C)c1ccc(cc1)-n1cccn1