Reaction Details
TargetDisintegrin and metalloproteinase domain-containing protein 17
LigandBDBM50342971
Substrate/Competitorn/a
Meas. Tech.ChEMBL_744255 (CHEMBL1772062)
Ki 6.7±n/a nM
Citation Dai, CLi, DPopovici-Muller, JZhao, LGirijavallabhan, VMRosner, KELavey, BJRizvi, RShankar, BBWong, MKGuo, ZOrth, PStrickland, COSun, JNiu, XChen, SKozlowski, JALundell, DJPiwinski, JJShih, NYSiddiqui, MA 2-(2-Aminothiazol-4-yl)pyrrolidine-based tartrate diamides as potent, selective and orally bioavailable TACE inhibitors. Bioorg Med Chem Lett21:3172-6 (2011) 
 
Disintegrin and metalloproteinase domain-containing protein 17
Name:Disintegrin and metalloproteinase domain-containing protein 17
Type:Enzyme
Mol. Mass.:93007.89
Organism:Homo sapiens (Human)
Description:
Residue:824
BDBM50342971
NameBDBM50342971
Synonyms:CHEMBL1770632 | rac-(2R,3R)-N-((R)-1-(4-(1H-pyrazol-1-yl)phenyl)ethyl)-4-((3S)-2-(3-chlorophenyl)-3-hydroxypyrrolidin-1-yl)-2,3-dihydroxy-4-oxobutanamide
TypeSmall organic molecule
Emp. Form.C25H27ClN4O5
Mol. Mass.498.959
SMILESC[C@@H](NC(=O)[C@H](O)[C@@H](O)C(=O)N1CC[C@H](O)C1c1cccc(Cl)c1)c1ccc(cc1)-n1cccn1