Reaction Details
TargetDisintegrin and metalloproteinase domain-containing protein 17
LigandBDBM50342951
Substrate/Competitorn/a
Meas. Tech.ChEMBL_744255 (CHEMBL1772062)
Ki 1±n/a nM
Citation Dai, CLi, DPopovici-Muller, JZhao, LGirijavallabhan, VMRosner, KELavey, BJRizvi, RShankar, BBWong, MKGuo, ZOrth, PStrickland, COSun, JNiu, XChen, SKozlowski, JALundell, DJPiwinski, JJShih, NYSiddiqui, MA 2-(2-Aminothiazol-4-yl)pyrrolidine-based tartrate diamides as potent, selective and orally bioavailable TACE inhibitors. Bioorg Med Chem Lett21:3172-6 (2011) 
 
Disintegrin and metalloproteinase domain-containing protein 17
Name:Disintegrin and metalloproteinase domain-containing protein 17
Type:Enzyme
Mol. Mass.:93007.89
Organism:Homo sapiens (Human)
Description:
Residue:824
BDBM50342951
NameBDBM50342951
Synonyms:(2R,3R)-N-((R)-1-(4-(1H-pyrazol-1-yl)phenyl)ethyl)-4-((R)-2-(5-(4-fluorophenyl)-2-(methylamino)thiazol-4-yl)pyrrolidin-1-yl)-2,3-dihydroxy-4-oxobutanamide | CHEMBL1770818
TypeSmall organic molecule
Emp. Form.C29H31FN6O4S
Mol. Mass.578.658
SMILESCNc1nc([C@H]2CCCN2C(=O)[C@H](O)[C@@H](O)C(=O)N[C@H](C)c2ccc(cc2)-n2cccn2)c(s1)-c1ccc(F)cc1