Reaction Details
TargetDisintegrin and metalloproteinase domain-containing protein 17
LigandBDBM50342958
Substrate/Competitorn/a
Meas. Tech.ChEMBL_744255 (CHEMBL1772062)
Ki 1±n/a nM
Citation Dai, CLi, DPopovici-Muller, JZhao, LGirijavallabhan, VMRosner, KELavey, BJRizvi, RShankar, BBWong, MKGuo, ZOrth, PStrickland, COSun, JNiu, XChen, SKozlowski, JALundell, DJPiwinski, JJShih, NYSiddiqui, MA 2-(2-Aminothiazol-4-yl)pyrrolidine-based tartrate diamides as potent, selective and orally bioavailable TACE inhibitors. Bioorg Med Chem Lett21:3172-6 (2011) 
 
Disintegrin and metalloproteinase domain-containing protein 17
Name:Disintegrin and metalloproteinase domain-containing protein 17
Type:Enzyme
Mol. Mass.:93007.89
Organism:Homo sapiens (Human)
Description:
Residue:824
BDBM50342958
NameBDBM50342958
Synonyms:(2R,3R)-N-((R)-1-(4-(1H-pyrazol-1-yl)phenyl)ethyl)-2,3-dihydroxy-4-((1R,3R,5R)-3-(2-(methylamino)thiazol-4-yl)-2-azabicyclo[3.1.0]hexan-2-yl)-4-oxobutanamide | CHEMBL1770824
TypeSmall organic molecule
Emp. Form.C24H28N6O4S
Mol. Mass.496.582
SMILESCNc1nc(cs1)[C@H]1C[C@H]2C[C@H]2N1C(=O)[C@H](O)[C@@H](O)C(=O)N[C@H](C)c1ccc(cc1)-n1cccn1