Reaction Details
TargetHistamine H4 receptor
LigandBDBM50343021
Substrate/Competitorn/a
Meas. Tech.ChEMBL_744294 (CHEMBL1772151)
Ki 0.2±n/a nM
Citation Meduna, SPSavall, BMCai, HEdwards, JPThurmond, RLMcGovern, PM Triamino pyrimidines and pyridines as histamine H(4) receptor modulators. Bioorg Med Chem Lett21:3113-6 (2011) 
 
Histamine H4 receptor
Name:Histamine H4 receptor
Type:G Protein-Coupled Receptor (GPCR)
Mol. Mass.:44517.02
Organism:Homo sapiens (Human)
Description:Binding assays were using CHO cells stably expressing hH4R receptors.
Residue:390
BDBM50343021
NameBDBM50343021
Synonyms:(R)-N2-isobutyl-4-(3-(methylamino)pyrrolidin-1-yl)pyridine-2,6-diamine | CHEMBL1770971
TypeSmall organic molecule
Emp. Form.C14H25N5
Mol. Mass.263.3818
SMILESCN[C@@H]1CCN(C1)c1cc(N)nc(NCC(C)C)c1