Reaction Details
TargetHistamine H4 receptor
LigandBDBM50343023
Substrate/Competitorn/a
Meas. Tech.ChEMBL_744294 (CHEMBL1772151)
Ki 0.9±n/a nM
Citation Meduna, SPSavall, BMCai, HEdwards, JPThurmond, RLMcGovern, PM Triamino pyrimidines and pyridines as histamine H(4) receptor modulators. Bioorg Med Chem Lett21:3113-6 (2011) 
 
Histamine H4 receptor
Name:Histamine H4 receptor
Type:G Protein-Coupled Receptor (GPCR)
Mol. Mass.:44517.02
Organism:Homo sapiens (Human)
Description:Binding assays were using CHO cells stably expressing hH4R receptors.
Residue:390
BDBM50343023
NameBDBM50343023
Synonyms:(R)-N2-cyclopentyl-4-(3-(methylamino)pyrrolidin-1-yl)pyridine-2,6-diamine | CHEMBL1770973
TypeSmall organic molecule
Emp. Form.C15H25N5
Mol. Mass.275.3925
SMILESCN[C@@H]1CCN(C1)c1cc(N)nc(NC2CCCC2)c1