Reaction Details
TargetHistamine H4 receptor
LigandBDBM50342987
Substrate/Competitorn/a
Meas. Tech.ChEMBL_744295 (CHEMBL1772152)
EC50 12±n/a nM
Citation Meduna, SPSavall, BMCai, HEdwards, JPThurmond, RLMcGovern, PM Triamino pyrimidines and pyridines as histamine H(4) receptor modulators. Bioorg Med Chem Lett21:3113-6 (2011) 
 
Histamine H4 receptor
Name:Histamine H4 receptor
Type:G Protein-Coupled Receptor (GPCR)
Mol. Mass.:44517.02
Organism:Homo sapiens (Human)
Description:Binding assays were using CHO cells stably expressing hH4R receptors.
Residue:390
BDBM50342987
NameBDBM50342987
Synonyms:CHEMBL1770998 | N4-isopropyl-6-(4-methylpiperazin-1-yl)pyrimidine-2,4-diamine
TypeSmall organic molecule
Emp. Form.C12H22N6
Mol. Mass.250.3433
SMILESCC(C)Nc1cc(nc(N)n1)N1CCN(C)CC1