Reaction Details
TargetHistamine H4 receptor
LigandBDBM50343016
Substrate/Competitorn/a
Meas. Tech.ChEMBL_744295 (CHEMBL1772152)
EC50 11±n/a nM
Citation Meduna, SPSavall, BMCai, HEdwards, JPThurmond, RLMcGovern, PM Triamino pyrimidines and pyridines as histamine H(4) receptor modulators. Bioorg Med Chem Lett21:3113-6 (2011) 
 
Histamine H4 receptor
Name:Histamine H4 receptor
Type:G Protein-Coupled Receptor (GPCR)
Mol. Mass.:44517.02
Organism:Homo sapiens (Human)
Description:Binding assays were using CHO cells stably expressing hH4R receptors.
Residue:390
BDBM50343016
NameBDBM50343016
Synonyms:CHEMBL1770966 | N2-cyclopentyl-4-(4-methylpiperazin-1-yl)pyridine-2,6-diamine
TypeSmall organic molecule
Emp. Form.C15H25N5
Mol. Mass.275.3925
SMILESCN1CCN(CC1)c1cc(N)nc(NC2CCCC2)c1