Reaction Details
TargetMatrix metalloproteinase-9
LigandBDBM11885
Substrate/Competitorn/a
Meas. Tech.ChEMBL_744871 (CHEMBL1772892)
IC50 1.5±n/a nM
Citation Fobian, YMFreskos, JNBarta, TEBedell, LJHeintz, RKassab, DJKiefer, JRMischke, BVMolyneaux, JMMullins, PMunie, GEBecker, DP MMP-13 selective alpha-sulfone hydroxamates: identification of selective P1' amides. Bioorg Med Chem Lett21:2823-5 (2011) 
 
Matrix metalloproteinase-9
Name:Matrix metalloproteinase-9
Type:Enzyme
Mol. Mass.:78452.28
Organism:Homo sapiens (Human)
Description:P14780
Residue:707
BDBM11885
NameBDBM11885
Synonyms:CHEMBL1082381 N-hydroxy-4-{[4-(phenylsulfanyl)benzene]sulfonyl}-1-(prop-2-yn-1-yl)piperidine-4-carboxamide hydrochloride alpha-sulfone 35f
TypeSmall organic molecule
Emp. Form.C21H22N2O4S2
Mol. Mass.430.54
SMILESONC(=O)C1(CCN(CC#C)CC1)S(=O)(=O)c1ccc(Sc2ccccc2)cc1