Reaction Details
TargetMatrix metalloproteinase-9
LigandBDBM50343062
Substrate/Competitorn/a
Meas. Tech.ChEMBL_744871 (CHEMBL1772892)
IC50 180±n/a nM
Citation Fobian, YMFreskos, JNBarta, TEBedell, LJHeintz, RKassab, DJKiefer, JRMischke, BVMolyneaux, JMMullins, PMunie, GEBecker, DP MMP-13 selective alpha-sulfone hydroxamates: identification of selective P1' amides. Bioorg Med Chem Lett21:2823-5 (2011) 
 
Matrix metalloproteinase-9
Name:Matrix metalloproteinase-9
Type:Enzyme
Mol. Mass.:78452.28
Organism:Homo sapiens (Human)
Description:P14780
Residue:707
BDBM50343062
NameBDBM50343062
Synonyms:CHEMBL1770709 | N-hydroxy-4-(4-(4-oxo-4-(4-(trifluoromethoxy)phenylamino)butoxy)phenylsulfonyl)tetrahydro-2H-pyran-4-carboxamide
TypeSmall organic molecule
Emp. Form.C23H25F3N2O8S
Mol. Mass.546.513
SMILESONC(=O)C1(CCOCC1)S(=O)(=O)c1ccc(OCCCC(=O)Nc2ccc(OC(F)(F)F)cc2)cc1