Reaction Details
Target72 kDa type IV collagenase
LigandBDBM50343066
Substrate/Competitorn/a
Meas. Tech.ChEMBL_744869 (CHEMBL1772890)
IC50 6.6±n/a nM
Citation Fobian, YMFreskos, JNBarta, TEBedell, LJHeintz, RKassab, DJKiefer, JRMischke, BVMolyneaux, JMMullins, PMunie, GEBecker, DP MMP-13 selective alpha-sulfone hydroxamates: identification of selective P1' amides. Bioorg Med Chem Lett21:2823-5 (2011) 
 
72 kDa type IV collagenase
Name:72 kDa type IV collagenase
Type:Enzyme
Mol. Mass.:73870.36
Organism:Homo sapiens (Human)
Description: P08253
Residue:660
BDBM50343066
NameBDBM50343066
Synonyms:CHEMBL1770712 | N-hydroxy-4-(4-(4-(4-methoxyphenoxy)butoxy)phenylsulfonyl)tetrahydro-2H-pyran-4-carboxamide
TypeSmall organic molecule
Emp. Form.C23H29NO8S
Mol. Mass.479.543
SMILESCOc1ccc(OCCCCOc2ccc(cc2)S(=O)(=O)C2(CCOCC2)C(=O)NO)cc1