Reaction Details
TargetNeutrophil collagenase
LigandBDBM50343052
Substrate/Competitorn/a
Meas. Tech.ChEMBL_744870 (CHEMBL1772891)
IC50 900±n/a nM
Citation Fobian, YMFreskos, JNBarta, TEBedell, LJHeintz, RKassab, DJKiefer, JRMischke, BVMolyneaux, JMMullins, PMunie, GEBecker, DP MMP-13 selective alpha-sulfone hydroxamates: identification of selective P1' amides. Bioorg Med Chem Lett21:2823-5 (2011) 
 
Neutrophil collagenase
Name:Neutrophil collagenase
Type:Enzyme
Mol. Mass.:53413.48
Organism:Homo sapiens (Human)
Description:P22894
Residue:467
BDBM50343052
NameBDBM50343052
Synonyms:CHEMBL1770700 | N-hydroxy-4-(4-(3-(4-methoxybenzamido)propoxy)phenylsulfonyl)tetrahydro-2H-pyran-4-carboxamide
TypeSmall organic molecule
Emp. Form.C23H28N2O8S
Mol. Mass.492.542
SMILESCOc1ccc(cc1)C(=O)NCCCOc1ccc(cc1)S(=O)(=O)C1(CCOCC1)C(=O)NO