Reaction Details
TargetNeutrophil collagenase
LigandBDBM50343060
Substrate/Competitorn/a
Meas. Tech.ChEMBL_744870 (CHEMBL1772891)
IC50 100±n/a nM
Citation Fobian, YMFreskos, JNBarta, TEBedell, LJHeintz, RKassab, DJKiefer, JRMischke, BVMolyneaux, JMMullins, PMunie, GEBecker, DP MMP-13 selective alpha-sulfone hydroxamates: identification of selective P1' amides. Bioorg Med Chem Lett21:2823-5 (2011) 
 
Neutrophil collagenase
Name:Neutrophil collagenase
Type:Enzyme
Mol. Mass.:53413.48
Organism:Homo sapiens (Human)
Description:P22894
Residue:467
BDBM50343060
NameBDBM50343060
Synonyms:4-(4-(4-(4-(dimethylamino)phenylamino)-4-oxobutoxy)phenylsulfonyl)-N-hydroxytetrahydro-2H-pyran-4-carboxamide | CHEMBL1770708
TypeSmall organic molecule
Emp. Form.C24H31N3O7S
Mol. Mass.505.584
SMILESCN(C)c1ccc(NC(=O)CCCOc2ccc(cc2)S(=O)(=O)C2(CCOCC2)C(=O)NO)cc1