Reaction Details
TargetCollagenase 3
LigandBDBM50343059
Substrate/Competitorn/a
Meas. Tech.ChEMBL_744872 (CHEMBL1772893)
IC50 0.200000±n/a nM
Citation Fobian, YMFreskos, JNBarta, TEBedell, LJHeintz, RKassab, DJKiefer, JRMischke, BVMolyneaux, JMMullins, PMunie, GEBecker, DP MMP-13 selective alpha-sulfone hydroxamates: identification of selective P1' amides. Bioorg Med Chem Lett21:2823-5 (2011) 
 
Collagenase 3
Name:Collagenase 3
Type:Enzyme
Mol. Mass.:53808.06
Organism:Homo sapiens (Human)
Description:P45452
Residue:471
BDBM50343059
NameBDBM50343059
Synonyms:4-(4-(4-(4-(dimethylamino)phenyl)-4-oxobutoxy)phenylsulfonyl)-N-hydroxytetrahydro-2H-pyran-4-carboxamide | CHEMBL1770707
TypeSmall organic molecule
Emp. Form.C24H30N2O7S
Mol. Mass.490.569
SMILESCN(C)c1ccc(cc1)C(=O)CCCOc1ccc(cc1)S(=O)(=O)C1(CCOCC1)C(=O)NO