Reaction Details
TargetCollagenase 3
LigandBDBM50343060
Substrate/Competitorn/a
Meas. Tech.ChEMBL_744872 (CHEMBL1772893)
IC50 1.7±n/a nM
Citation Fobian, YMFreskos, JNBarta, TEBedell, LJHeintz, RKassab, DJKiefer, JRMischke, BVMolyneaux, JMMullins, PMunie, GEBecker, DP MMP-13 selective alpha-sulfone hydroxamates: identification of selective P1' amides. Bioorg Med Chem Lett21:2823-5 (2011) 
 
Collagenase 3
Name:Collagenase 3
Type:Enzyme
Mol. Mass.:53808.06
Organism:Homo sapiens (Human)
Description:P45452
Residue:471
BDBM50343060
NameBDBM50343060
Synonyms:4-(4-(4-(4-(dimethylamino)phenylamino)-4-oxobutoxy)phenylsulfonyl)-N-hydroxytetrahydro-2H-pyran-4-carboxamide | CHEMBL1770708
TypeSmall organic molecule
Emp. Form.C24H31N3O7S
Mol. Mass.505.584
SMILESCN(C)c1ccc(NC(=O)CCCOc2ccc(cc2)S(=O)(=O)C2(CCOCC2)C(=O)NO)cc1