Reaction Details
TargetCollagenase 3
LigandBDBM50343062
Substrate/Competitorn/a
Meas. Tech.ChEMBL_744872 (CHEMBL1772893)
IC50 0.200000±n/a nM
Citation Fobian, YMFreskos, JNBarta, TEBedell, LJHeintz, RKassab, DJKiefer, JRMischke, BVMolyneaux, JMMullins, PMunie, GEBecker, DP MMP-13 selective alpha-sulfone hydroxamates: identification of selective P1' amides. Bioorg Med Chem Lett21:2823-5 (2011) 
 
Collagenase 3
Name:Collagenase 3
Type:Enzyme
Mol. Mass.:53808.06
Organism:Homo sapiens (Human)
Description:P45452
Residue:471
BDBM50343062
NameBDBM50343062
Synonyms:CHEMBL1770709 | N-hydroxy-4-(4-(4-oxo-4-(4-(trifluoromethoxy)phenylamino)butoxy)phenylsulfonyl)tetrahydro-2H-pyran-4-carboxamide
TypeSmall organic molecule
Emp. Form.C23H25F3N2O8S
Mol. Mass.546.513
SMILESONC(=O)C1(CCOCC1)S(=O)(=O)c1ccc(OCCCC(=O)Nc2ccc(OC(F)(F)F)cc2)cc1