Reaction Details
TargetBeta-secretase 1
LigandBDBM50343136
Substrate/Competitorn/a
Meas. Tech.ChEMBL_744133 (CHEMBL1771832)
Ki 10600±n/a nM
Citation Cho, JKRyu, YBCurtis-Long, MJKim, JYKim, DLee, SLee, WSPark, KH Inhibition and structural reliability of prenylated flavones from the stem bark of Morus lhou on β-secretase (BACE-1). Bioorg Med Chem Lett21:2945-8 (2011) 
 
Beta-secretase 1
Name:Beta-secretase 1
Type:Protein
Mol. Mass.:55755.10
Organism:Homo sapiens (Human)
Description:P56817
Residue:501
BDBM50343136
NameBDBM50343136
Synonyms:CHEMBL1770312 | Kuwanon A
TypeSmall organic molecule
Emp. Form.C25H24O6
Mol. Mass.420.4545
SMILES[#6]\[#6](-[#6])=[#6]\[#6]-c1c(-[#8])c2c(cc(-[#8])cc2=O)oc1-c1ccc(-[#8])c2-[#6]=[#6]C([#6])([#6])[#8]-c12