Reaction Details
TargetD(2) dopamine receptor
LigandBDBM50343261
Substrate/Competitorn/a
Meas. Tech.ChEMBL_745646 (CHEMBL1776016)
Ki 1±n/a nM
Citation Johnson, DSChoi, CFay, LKFavor, DARepine, JTWhite, ADAkunne, HCFitzgerald, LNicholls, KSnyder, BJWhetzel, SZZhang, LSerpa, KA Discovery of PF-00217830: aryl piperazine napthyridinones as D2 partial agonists for schizophrenia and bipolar disorder. Bioorg Med Chem Lett21:2621-5 (2011) 
 
D(2) dopamine receptor
Name:D(2) dopamine receptor
Type:Cell-surface receptors
Mol. Mass.:50647.10
Organism:Homo sapiens (Human)
Description:P14416
Residue:443
BDBM50343261
NameBDBM50343261
Synonyms:7-(4-(4-(2,3-dichlorophenyl)piperazin-1-yl)butoxy)-1,8-naphthyridin-2(1H)-one | CHEMBL1774064
TypeSmall organic molecule
Emp. Form.C22H24Cl2N4O2
Mol. Mass.447.358
SMILESClc1cccc(N2CCN(CCCCOc3ccc4ccc(=O)[nH]c4n3)CC2)c1Cl