Reaction Details
TargetD(2) dopamine receptor
LigandBDBM50343264
Substrate/Competitorn/a
Meas. Tech.ChEMBL_745646 (CHEMBL1776016)
Ki 5.7±n/a nM
Citation Johnson, DSChoi, CFay, LKFavor, DARepine, JTWhite, ADAkunne, HCFitzgerald, LNicholls, KSnyder, BJWhetzel, SZZhang, LSerpa, KA Discovery of PF-00217830: aryl piperazine napthyridinones as D2 partial agonists for schizophrenia and bipolar disorder. Bioorg Med Chem Lett21:2621-5 (2011) 
 
D(2) dopamine receptor
Name:D(2) dopamine receptor
Type:Cell-surface receptors
Mol. Mass.:50647.10
Organism:Homo sapiens (Human)
Description:P14416
Residue:443
BDBM50343264
NameBDBM50343264
Synonyms:7-(4-(4-(2-chlorophenyl)piperazin-1-yl)butoxy)-3,4-dihydro-1,8-naphthyridin-2(1H)-one | CHEMBL1774067
TypeSmall organic molecule
Emp. Form.C22H27ClN4O2
Mol. Mass.414.928
SMILESClc1ccccc1N1CCN(CCCCOc2ccc3CCC(=O)Nc3n2)CC1