Reaction Details
TargetD(2) dopamine receptor
LigandBDBM50343279
Substrate/Competitorn/a
Meas. Tech.ChEMBL_745646 (CHEMBL1776016)
Ki 1.1±n/a nM
Citation Johnson, DSChoi, CFay, LKFavor, DARepine, JTWhite, ADAkunne, HCFitzgerald, LNicholls, KSnyder, BJWhetzel, SZZhang, LSerpa, KA Discovery of PF-00217830: aryl piperazine napthyridinones as D2 partial agonists for schizophrenia and bipolar disorder. Bioorg Med Chem Lett21:2621-5 (2011) 
 
D(2) dopamine receptor
Name:D(2) dopamine receptor
Type:Cell-surface receptors
Mol. Mass.:50647.10
Organism:Homo sapiens (Human)
Description:P14416
Residue:443
BDBM50343279
NameBDBM50343279
Synonyms:7-(4-(4-(3-fluoronaphthalen-1-yl)piperazin-1-yl)butoxy)-3,4-dihydro-1,8-naphthyridin-2(1H)-one | CHEMBL1774082
TypeSmall organic molecule
Emp. Form.C26H29FN4O2
Mol. Mass.448.5325
SMILESFc1cc(N2CCN(CCCCOc3ccc4CCC(=O)Nc4n3)CC2)c2ccccc2c1